{"text_format":"1","workbook":"xlsx","n_sheets":3,"sheets":["Pivots","Meeting Log","Workbook Reference Fields"],"not_rendered":{"charts":0,"images":0,"macros":1,"external_links":0,"defined_names":0,"comments":0,"pivot_tables":5},"unopened":[],"bounds":{"document_bytes":16777216,"sheet_cells":100000,"rows_first":2000,"rows_last":500,"rows_between":2000,"halvings":0,"cell_chars":16384,"cell_head_chars":4096},"cells_cut":0,"cells_raw":0,"read":"whole","date_system":"1900"}

{"sheet":"Pivots","index":0,"n_rows":44,"n_cols":22,"rows_kept":44,"cut":false,"hidden":false,"merged":[]}
[]
[null,"Meeting Details",null,null,null,"Participants",null,null,"Topics Discussed",null,null,"Meeting Summary",null,null,"Discussion with an Action Item",null,null,null,null,"Full Meeting Minutes"]
[]
[null,null,null,null,null,null,null,null,null,null,null,null,null,null,"Action Item","Yes"]
[]
[null,null,null,null,null,"Participants",null,null,"Topics",null,null,"Summary",null,null,"Timestamp","Participant","Comment",null,null,"Timestamp","Participant","Comment"]
[null,"Date of Meeting",{"$f":"'Meeting Log'!C2","v":"2021-03-23"},null,null,"Arleen Valser",null,null,"Asoka",null,null,"Aivamus metus arcu adipiscing molestie Asoka 13.1 hendrerit at vulputate vitae nisl.\n\nAenean lectus pellentesque eget, Perri et Arleen.",null,null,"2021-03-23T10:34:51","Arleen Valser","Dolor sit amet consectetuer adipiscing elit proin risus praesent lectus. Perri vestibulum quam sapien varius ut blandit non.",null,null,"2021-03-23T10:30:29","Perri Comford","Dis parturient montes nascetur ridiculus mus etiam vel augue vestibulum rutrum rutrum neque."]
[null,"Purpose",{"$f":"'Meeting Log'!C3","v":"Metus aenean ZooLab, Asoka, Zontrax, praesent Regrant, Tempsoft et dolor sit."},null,null,"Celeste Danniel",null,null,"Regrant",null,null,"Arleen sed augue aliquam erat volutpat in congue etiam justo etiam pretium iaculis justo.",null,null,"2021-03-23T10:40:58","Perri Comford","Lacinia erat vestibulum sed Arleen magna at nunc commodo placerat praesent blandit nam nulla integer pede justo.",null,null,"2021-03-23T10:30:43","Perri Comford","Hac habitasse, platea dictumst maecenas ut massa quis augue luctus tincidunt nulla mollis."]
[null,"Start",{"$f":"'Meeting Log'!B7","v":"2021-03-23T10:30:29"},null,null,"Dulci Gudahy",null,null,"Tempsoft",null,null,"Id nulla ultrices aliquet maecenas leo odio condimentum. Perr id luctus nec molestie sed justo pellentesque viverra pede",null,null,"2021-03-23T10:44:18","Celeste Danniel","Amet lobortis sapien Perri sapien non mi integer ac neque duis bibendum morbi non quam.",null,null,"2021-03-23T10:31:37","Celeste Danniel","Porta volutpat erat quisque erat eros; viverra eget congue eget semper rutrum."]
[null,"End",{"$f":"LOOKUP(2,1/(1-ISBLANK('Meeting Log'!B:B)),'Meeting Log'!B:B)","v":"2021-03-23T10:51:47"},null,null,"Perri Comford",null,null,"Zontrax",null,null,"Lacus purus aliquet at feugiat non pretium quis lectus.\n\nSuspendisse potenti in eleifend quam a odio in hac habitasse.",null,null,null,null,null,null,null,"2021-03-23T10:32:35","Celeste Danniel","Maecenas rhoncus aliquam lacus morbi quis tortor id nulla ultrices aliquet."]
[null,"Duration",{"$f":"IF(C10=\"\",\"\",INT(C10-C9)&\" days \" &TEXT(C10-C9,\"h\"\" hrs \"\"m\"\" mins \"\"s\"\" secs\"\"\"))","v":"0 days 0 hrs 21 mins 18 secs"},null,null,null,null,null,"ZooLab",null,null,"Quis tortor id nulla ultrices aliquet maecenas leo odio condimentum id luctus.",null,null,null,null,null,null,null,"2021-03-23T10:32:42","Perri Comford","Dapibus augue Vel Celeste accumsan tellus nisi eu orci mauris lacinia sapien quis libero."]
[null,null,null,null,null,null,null,null,null,null,null,"Vestibulum ante ipsum primis in faucibus orci luctus et ultrices posuere, Arleen.\n\nCubilia curae nulla dapibus dolor vel.",null,null,null,null,null,null,null,"2021-03-23T10:34:41","Celeste Danniel","Ut Massa volutpat convallis morbi odio odio elementum eu interdum eu tincidunt."]
[null,null,null,null,null,null,null,null,null,null,null,null,null,null,null,null,null,null,null,"2021-03-23T10:34:45","Arleen Valser","Nunc nisl duis bibendum felis sed interdum venenatis turpis enim."]
[null,null,null,null,null,null,null,null,null,null,null,null,null,null,null,null,null,null,null,"2021-03-23T10:34:51","Arleen Valser","Dolor sit amet consectetuer adipiscing elit proin risus praesent lectus. Perri vestibulum quam sapien varius ut blandit non."]
[null,null,null,null,null,null,null,null,null,null,null,null,null,null,null,null,null,null,null,"2021-03-23T10:34:54","Celeste Danniel","Cras non velit nec nisi vulputate nonummy maecenas tincidunt lacus."]
[null,null,null,null,null,null,null,null,null,null,null,null,null,null,null,null,null,null,null,"2021-03-23T10:34:57","Perri Comford","AC nulla sed vel enim sit amet nunc viverra dapibus nulla suscipit ligula in."]
[null,null,null,null,null,null,null,null,null,null,null,null,null,null,null,null,null,null,null,"2021-03-23T10:34:59","Perri Comford","Quis augue luctus tincidunt nulla mollis molestie lorem quisque ut erat curabitur gravida nisi at nibh in hac."]
[null,null,null,null,null,null,null,null,null,null,null,null,null,null,null,null,null,null,null,"2021-03-23T10:36:08","Arleen Valser","Adipiscing molestie hendrerit at vulputate vitae nisl aenean lectus pellentesque eget."]
[null,null,null,null,null,null,null,null,null,null,null,null,null,null,null,null,null,null,null,"2021-03-23T10:36:14","Perri Comford","Posuere cubilia curae duis faucibus accumsan odio curabitur. Convallis duis consequat dui nec."]
[null,null,null,null,null,null,null,null,null,null,null,null,null,null,null,null,null,null,null,"2021-03-23T10:37:34","Perri Comford","ID luctus nec molestie sed Dulci justo pellentesque viverra pede ac diam cras pellentesque."]
[null,null,null,null,null,null,null,null,null,null,null,null,null,null,null,null,null,null,null,"2021-03-23T10:37:40","Dulci Gudahy","Quam a odio in hac habitasse platea dictumst maecenas ut massa quis augue."]
[null,null,null,null,null,null,null,null,null,null,null,null,null,null,null,null,null,null,null,"2021-03-23T10:37:55","Perri Comford","Qem praesent id massa id nisl venenatis lacinia aenean sit amet justo morbi ut odio."]
[null,null,null,null,null,null,null,null,null,null,null,null,null,null,null,null,null,null,null,"2021-03-23T10:38:27","Perri Comford","Orci pede venenatis non sodales sed tincidunt eu felis fusce posuere felis sed lacus morbi sem mauris laoreet."]
[null,null,null,null,null,null,null,null,null,null,null,null,null,null,null,null,null,null,null,"2021-03-23T10:39:10","Celeste Danniel","Lectus in est risus auctor sed tristique in tempus sit amet sem fusce consequat."]
[null,null,null,null,null,null,null,null,null,null,null,null,null,null,null,null,null,null,null,"2021-03-23T10:39:12","Celeste Danniel","Dolor morbi vel lectus in quam fringilla rhoncus mauris enim leo rhoncus sed vestibulum sit."]
[null,null,null,null,null,null,null,null,null,null,null,null,null,null,null,null,null,null,null,"2021-03-23T10:39:15","Perri Comford","Nec nisi vulputate nonummy maecenas tincidunt lacus at velit vivamus."]
[null,null,null,null,null,null,null,null,null,null,null,null,null,null,null,null,null,null,null,"2021-03-23T10:40:01","Celeste Danniel","Sed vestibulum sit amet cursus id turpis integer aliquet massa id lobortis convallis tortor risus dapibus."]
[null,null,null,null,null,null,null,null,null,null,null,null,null,null,null,null,null,null,null,"2021-03-23T10:40:05","Perri Comford","Nam ultrices libero non mattis pulvinar nulla pede ullamcorper augue a suscipit nulla elit ac nulla."]
[null,null,null,null,null,null,null,null,null,null,null,null,null,null,null,null,null,null,null,"2021-03-23T10:40:51","Arleen Valser","Adipiscing molestie hendrerit at vulputate vitae nisl aenean lectus pellentesque eget nunc."]
[null,null,null,null,null,null,null,null,null,null,null,null,null,null,null,null,null,null,null,"2021-03-23T10:40:58","Perri Comford","Lacinia erat vestibulum sed Arleen magna at nunc commodo placerat praesent blandit nam nulla integer pede justo."]
[null,null,null,null,null,null,null,null,null,null,null,null,null,null,null,null,null,null,null,"2021-03-23T10:41:01","Arleen Valser","Nascetur ridiculus mus etiam vel augue vestibulum rutrum rutrum neque aenean auctor gravida sem praesent id massa id."]
[null,null,null,null,null,null,null,null,null,null,null,null,null,null,null,null,null,null,null,"2021-03-23T10:41:41","Celeste Danniel","Nunc rhoncus dui vel sem sed sagittis nam congue risus semper porta volutpat quam pede lobortis ligula sit."]
[null,null,null,null,null,null,null,null,null,null,null,null,null,null,null,null,null,null,null,"2021-03-23T10:41:45","Perri Comford","Luctus et ultrices posuere cubilia curae duis faucibus accumsan. Odio curabitur convallis duis consequat dui nec nisi volutpat."]
[null,null,null,null,null,null,null,null,null,null,null,null,null,null,null,null,null,null,null,"2021-03-23T10:42:56","Celeste Danniel","Arcu sed augue aliquam erat volutpat in congue etiam justo etiam pretium iaculis justo in hac habitasse platea dictumst etiam."]
[null,null,null,null,null,null,null,null,null,null,null,null,null,null,null,null,null,null,null,"2021-03-23T10:42:59","Perri Comford","Arat volutpat Arleen in congue etiam. Justo etiam pretium iaculis justo."]
[null,null,null,null,null,null,null,null,null,null,null,null,null,null,null,null,null,null,null,"2021-03-23T10:43:45","Arleen Valser","Maecenas tristique est et tempus semper est quam. Pharetra magna ac consequat."]
[null,null,null,null,null,null,null,null,null,null,null,null,null,null,null,null,null,null,null,"2021-03-23T10:44:12","Perri Comford","Turpis a pede posuere nonummy integer non velit donec diam neque. Vestibulum eget vulputate ut ultrices vel augue vestibulum."]
[null,null,null,null,null,null,null,null,null,null,null,null,null,null,null,null,null,null,null,"2021-03-23T10:44:18","Celeste Danniel","Amet lobortis sapien Perri sapien non mi integer ac neque duis bibendum morbi non quam."]
[null,null,null,null,null,null,null,null,null,null,null,null,null,null,null,null,null,null,null,"2021-03-23T10:45:05","Perri Comford","Nullam varius nulla facilisi cras non velit nec nisi vulputate nonummy maecenas."]
[null,null,null,null,null,null,null,null,null,null,null,null,null,null,null,null,null,null,null,"2021-03-23T10:45:57","Celeste Danniel","Quis tortor id nulla ultrices aliquet maecenas leo odio condimentum. ID luctus nec molestie sed justo pellentesque."]
[null,null,null,null,null,null,null,null,null,null,null,null,null,null,null,null,null,null,null,"2021-03-23T10:46:00","Perri Comford","Vitae Mattis nibh ligula nec Sem Duis aliquam convallis nunc proin at turpis a pede, posuere nonummy."]
[null,null,null,null,null,null,null,null,null,null,null,null,null,null,null,null,null,null,null,"2021-03-23T10:51:44","Celeste Danniel","Rhoncus dui vel sem sed sagittis nam congue risus semper porta volutpat quam pede lobortis ligula sit amet eleifend pede."]
[null,null,null,null,null,null,null,null,null,null,null,null,null,null,null,null,null,null,null,"2021-03-23T10:51:45","Perri Comford","Ut at dolor quis odio consequat varius integer ac leo pellentesque, ultrices mattis odio donec vitae nisi nam ultrices."]
[null,null,null,null,null,null,null,null,null,null,null,null,null,null,null,null,null,null,null,"2021-03-23T10:51:47","Celeste Danniel","Lobortis ligula sit amet eleifend pede libero quis orci nullam. Molestie nibh in lectus pellentesque at nulla suspendisse potenti."]

{"sheet":"Meeting Log","index":1,"n_rows":44,"n_cols":7,"rows_kept":44,"cut":false,"hidden":false,"merged":[[33,5,39,5],[40,5,43,5],[6,6,13,6],[14,6,20,6],[21,6,25,6],[26,6,32,6],[33,6,39,6],[40,6,43,6],[1,2,1,6],[2,2,2,6],[6,5,13,5],[14,5,20,5],[21,5,32,5]]}
[]
[null,"Date","2021-03-23"]
[null,"Purpose of Meeting","Metus aenean ZooLab, Asoka, Zontrax, praesent Regrant, Tempsoft et dolor sit."]
[]
[null,"Meeting Log"]
[null,"Timestamp","Participant","Comment","Action Item","Topic","Summary"]
[null,"2021-03-23T10:30:29","Perri Comford","Dis parturient montes nascetur ridiculus mus etiam vel augue vestibulum rutrum rutrum neque.",null,"ZooLab","Vestibulum ante ipsum primis in faucibus orci luctus et ultrices posuere, Arleen.\n\nCubilia curae nulla dapibus dolor vel."]
[null,"2021-03-23T10:30:43","Perri Comford","Hac habitasse, platea dictumst maecenas ut massa quis augue luctus tincidunt nulla mollis."]
[null,"2021-03-23T10:31:37","Celeste Danniel","Porta volutpat erat quisque erat eros; viverra eget congue eget semper rutrum."]
[null,"2021-03-23T10:32:35","Celeste Danniel","Maecenas rhoncus aliquam lacus morbi quis tortor id nulla ultrices aliquet."]
[null,"2021-03-23T10:32:42","Perri Comford","Dapibus augue Vel Celeste accumsan tellus nisi eu orci mauris lacinia sapien quis libero."]
[null,"2021-03-23T10:34:41","Celeste Danniel","Ut Massa volutpat convallis morbi odio odio elementum eu interdum eu tincidunt."]
[null,"2021-03-23T10:34:45","Arleen Valser","Nunc nisl duis bibendum felis sed interdum venenatis turpis enim."]
[null,"2021-03-23T10:34:51","Arleen Valser","Dolor sit amet consectetuer adipiscing elit proin risus praesent lectus. Perri vestibulum quam sapien varius ut blandit non.","Yes"]
[null,"2021-03-23T10:34:54","Celeste Danniel","Cras non velit nec nisi vulputate nonummy maecenas tincidunt lacus.",null,"Asoka","Aivamus metus arcu adipiscing molestie Asoka 13.1 hendrerit at vulputate vitae nisl.\n\nAenean lectus pellentesque eget, Perri et Arleen."]
[null,"2021-03-23T10:34:57","Perri Comford","AC nulla sed vel enim sit amet nunc viverra dapibus nulla suscipit ligula in."]
[null,"2021-03-23T10:34:59","Perri Comford","Quis augue luctus tincidunt nulla mollis molestie lorem quisque ut erat curabitur gravida nisi at nibh in hac."]
[null,"2021-03-23T10:36:08","Arleen Valser","Adipiscing molestie hendrerit at vulputate vitae nisl aenean lectus pellentesque eget."]
[null,"2021-03-23T10:36:14","Perri Comford","Posuere cubilia curae duis faucibus accumsan odio curabitur. Convallis duis consequat dui nec."]
[null,"2021-03-23T10:37:34","Perri Comford","ID luctus nec molestie sed Dulci justo pellentesque viverra pede ac diam cras pellentesque."]
[null,"2021-03-23T10:37:40","Dulci Gudahy","Quam a odio in hac habitasse platea dictumst maecenas ut massa quis augue."]
[null,"2021-03-23T10:37:55","Perri Comford","Qem praesent id massa id nisl venenatis lacinia aenean sit amet justo morbi ut odio.",null,"Zontrax","Lacus purus aliquet at feugiat non pretium quis lectus.\n\nSuspendisse potenti in eleifend quam a odio in hac habitasse."]
[null,"2021-03-23T10:38:27","Perri Comford","Orci pede venenatis non sodales sed tincidunt eu felis fusce posuere felis sed lacus morbi sem mauris laoreet."]
[null,"2021-03-23T10:39:10","Celeste Danniel","Lectus in est risus auctor sed tristique in tempus sit amet sem fusce consequat."]
[null,"2021-03-23T10:39:12","Celeste Danniel","Dolor morbi vel lectus in quam fringilla rhoncus mauris enim leo rhoncus sed vestibulum sit."]
[null,"2021-03-23T10:39:15","Perri Comford","Nec nisi vulputate nonummy maecenas tincidunt lacus at velit vivamus."]
[null,"2021-03-23T10:40:01","Celeste Danniel","Sed vestibulum sit amet cursus id turpis integer aliquet massa id lobortis convallis tortor risus dapibus.",null,null,"Arleen sed augue aliquam erat volutpat in congue etiam justo etiam pretium iaculis justo."]
[null,"2021-03-23T10:40:05","Perri Comford","Nam ultrices libero non mattis pulvinar nulla pede ullamcorper augue a suscipit nulla elit ac nulla."]
[null,"2021-03-23T10:40:51","Arleen Valser","Adipiscing molestie hendrerit at vulputate vitae nisl aenean lectus pellentesque eget nunc."]
[null,"2021-03-23T10:40:58","Perri Comford","Lacinia erat vestibulum sed Arleen magna at nunc commodo placerat praesent blandit nam nulla integer pede justo.","Yes"]
[null,"2021-03-23T10:41:01","Arleen Valser","Nascetur ridiculus mus etiam vel augue vestibulum rutrum rutrum neque aenean auctor gravida sem praesent id massa id."]
[null,"2021-03-23T10:41:41","Celeste Danniel","Nunc rhoncus dui vel sem sed sagittis nam congue risus semper porta volutpat quam pede lobortis ligula sit."]
[null,"2021-03-23T10:41:45","Perri Comford","Luctus et ultrices posuere cubilia curae duis faucibus accumsan. Odio curabitur convallis duis consequat dui nec nisi volutpat."]
[null,"2021-03-23T10:42:56","Celeste Danniel","Arcu sed augue aliquam erat volutpat in congue etiam justo etiam pretium iaculis justo in hac habitasse platea dictumst etiam.",null,"Regrant","Quis tortor id nulla ultrices aliquet maecenas leo odio condimentum id luctus."]
[null,"2021-03-23T10:42:59","Perri Comford","Arat volutpat Arleen in congue etiam. Justo etiam pretium iaculis justo."]
[null,"2021-03-23T10:43:45","Arleen Valser","Maecenas tristique est et tempus semper est quam. Pharetra magna ac consequat."]
[null,"2021-03-23T10:44:12","Perri Comford","Turpis a pede posuere nonummy integer non velit donec diam neque. Vestibulum eget vulputate ut ultrices vel augue vestibulum."]
[null,"2021-03-23T10:44:18","Celeste Danniel","Amet lobortis sapien Perri sapien non mi integer ac neque duis bibendum morbi non quam.","Yes"]
[null,"2021-03-23T10:45:05","Perri Comford","Nullam varius nulla facilisi cras non velit nec nisi vulputate nonummy maecenas."]
[null,"2021-03-23T10:45:57","Celeste Danniel","Quis tortor id nulla ultrices aliquet maecenas leo odio condimentum. ID luctus nec molestie sed justo pellentesque."]
[null,"2021-03-23T10:46:00","Perri Comford","Vitae Mattis nibh ligula nec Sem Duis aliquam convallis nunc proin at turpis a pede, posuere nonummy.",null,"Tempsoft","Id nulla ultrices aliquet maecenas leo odio condimentum. Perr id luctus nec molestie sed justo pellentesque viverra pede"]
[null,"2021-03-23T10:51:44","Celeste Danniel","Rhoncus dui vel sem sed sagittis nam congue risus semper porta volutpat quam pede lobortis ligula sit amet eleifend pede."]
[null,"2021-03-23T10:51:45","Perri Comford","Ut at dolor quis odio consequat varius integer ac leo pellentesque, ultrices mattis odio donec vitae nisi nam ultrices."]
[null,"2021-03-23T10:51:47","Celeste Danniel","Lobortis ligula sit amet eleifend pede libero quis orci nullam. Molestie nibh in lectus pellentesque at nulla suspendisse potenti."]

{"sheet":"Workbook Reference Fields","index":2,"n_rows":4,"n_cols":2,"rows_kept":4,"cut":false,"hidden":false,"merged":[]}
[]
[null,"Action Item"]
[null,"Yes"]
[null,"No"]